locationaddress.owl
type: Ontology
submission organisation: University of Sevilla
purpose: Describe physical address of a domicile or business
imports: protege
purpose: Describe la dirección de un domicilio o negocio @es
use: En un servidor demográfico @es
author: Isabel Román
imports: basearquetipo.owl
status: draft
submision date: 2004-07-21
use: Demographic service

locationAddress
type: Class
subclass of: ADDRESS
subclass of: Restriction
  all values from: AddressItems
  on property: details
comment: This is the particular Address type that we are building with this ontology. The details property is restricted to be of kind AddressItems, a list of items for an Address location

streetName
type: Class
subclass of: ELEMENT
text: street name
text: calle @es
description: name of the street
description: nombre de la calle @es
comment: Name restricted to the synonyms used in ACME terminology for streetName (these are expresed in other file, see namespace)
subclass of: Restriction
  all values from: Synonym of streetName
  on property: name
subclass of: Restriction
  all values from: DV TEXT
  on property: value

country
type: Class
subclass of: ELEMENT
subclass of: Restriction
  on property: name
  all values from: Synonym of country
comment: Name restricted to the synonyms used in ACME terminology for country (these are expresed in other file, see namespace)
description: country
text: nacion @es
description: nacion @es
text: country
subclass of: Restriction
  on property: value
  all values from: DV CODED TEXT

locality
type: Class
subclass of: Restriction
  all values from: DV TEXT
  on property: value
text: localidad @es
text: locality
description: name of the suburb, village, town
subclass of: ELEMENT
subclass of: Restriction
  on property: name
  all values from: Synonym of locality
description: nombre de la localidad @es
comment: Name restricted to the synonyms used in ACME terminology for locality (these are expresed in other file, see namespace)

buildingId
type: Class
subclass of: ELEMENT
text: building id
description: identificador didentificador del edificio @es
subclass of: Restriction
  on property: value
  all values from: DV TEXT
comment: Name restricted to the synonyms used in ACME terminology for buildingId (these are expresed in other file, see namespace)
text: id de edificio @es
description: identifier of the building
subclass of: Restriction
  all values from: Synonym of buildingId
  on property: name

state province
type: Class
subclass of: ELEMENT
subclass of: Restriction
  all values from: DV TEXT
  on property: value
description: state or province
description: provincia o estado @es
text: state/province
comment: Name restricted to the synonyms used in ACME terminology for state/province (these are expresed in other file, see namespace)
subclass of: Restriction
  on property: name
  all values from: Synonym of state province
text: estado/provincia @es

AddressItems
type: Class
subclass of: ITEM LIST
comment: The list that represents an address. The representation element is restricted to Address Cluster
description: elementos de la direccion @es
text: elemento de direccion @es
text: address items
subclass of: Restriction
  on property: representation
  all values from: Address
description: items in the address

Address
type: Class
subclass of: CLUSTER
comment: The cluster that contains the restrictions for the Address Items
subclass of: Restriction
  on property: AppartmentId
  max cardinality: 1
subclass of: Restriction
  max cardinality: 1
  on property: StreetName
subclass of: Restriction
  max cardinality: 1
  on property: PostCode
subclass of: Restriction
  on property: State Province
  max cardinality: 1
subclass of: Restriction
  max cardinality: 1
  on property: Country
subclass of: Restriction
  max cardinality: 1
  on property: BuildingId
subclass of: Restriction
  on property: Locality
  max cardinality: 1

appartmentId
type: Class
comment: Name restricted to the synonyms used in ACME terminology for appartmentId (these are expresed in other file, see namespace)
description: identifier of the appartment, studio or office in an address
description: identificación de un apartamento, studio u oficina en una direccion @es
text: appartment id
subclass of: Restriction
  on property: value
  all values from: DV TEXT
subclass of: ELEMENT
subclass of: Restriction
  on property: name
  all values from: Synonym of appartmentId
text: id de apartamento @es

postCode
type: Class
subclass of: Restriction
  on property: name
  all values from: Synonym of postCode
subclass of: ELEMENT
text: codigo postal @es
description: codigo postal de la direccion @es
text: postcode
subclass of: Restriction
  all values from: DV TEXT
  on property: value
comment: Name restricted to the synonyms used in ACME terminology for postCode (these are expresed in other file, see namespace)
description: postal code for the address